BDBM50065693 (E)-(S)-4-[(S)-2-((S)-2-Benzyloxycarbonylamino-4-methyl-pentanoylamino)-3-phenyl-propionylamino]-6-methylcarbamoyl-hex-2-enoic acid ethyl ester::CHEMBL20259
SMILES CCOC(=O)\C=C\[C@H](CCC(=O)NC)NC(=O)[C@H](Cc1ccccc1)NC(=O)[C@H](CC(C)C)NC(=O)OCc1ccccc1
InChI Key InChIKey=LNWHKNGBDXOAAK-OEHSNOHSSA-N
Data  1 EC50
  Tab Delimited (TSV)   2D SDfile   Computed 3D by Vconf -m prep SDfile
Find this compound or compounds like it in BindingDB:
Activity Spreadsheet -- Enzyme Inhibition Constant Data from BindingDB
Found 1 hit for monomerid = 50065693
TargetGenome polyprotein(Human rhinovirus B)
Agouron Pharmaceuticals
Curated by ChEMBL
LigandPNGBDBM50065693((E)-(S)-4-[(S)-2-((S)-2-Benzyloxycarbonylamino-4-m...)
Affinity DataEC50:  5.60E+3nM. Assay description: Increased percentage of formazan production in drug treated virus infected cells to equal 50% control drug free uninfected cells on serotype 14
In DepthDetails ArticlePubMed